{"text_format":"3","workbook":"xlsx","n_sheets":7,"sheets":["Document de vision","BACKLOG","Tableau de bord","CARDS","TEMPLATE","Sprint Vierge","Sprint 1"],"not_rendered":{"charts":3,"images":2,"macros":1,"defined_names":2,"comments":3},"read":"whole","date_system":"1900"}

{"sheet":"Document de vision","index":0,"n_rows":36,"n_cols":12,"rows_kept":36,"merged":[[0,0,0,1],[15,6,15,7],[16,6,16,7],[17,6,18,7],[28,2,28,3],[29,2,29,3],[30,2,30,3],[31,2,31,3],[32,2,32,3],[32,6,32,7],[33,2,33,3],[33,6,33,7],[34,2,34,3],[34,6,34,7],[35,2,35,3],[35,6,35,7],[36,2,36,3],[36,6,36,7],[37,2,37,3],[37,6,37,7],[38,6,38,7],[39,6,39,7],[40,6,40,7],[41,6,41,7],[42,6,42,7],[43,6,43,7]]}
["Document de vision",{"$nulls":4},"Pour qui ? portraits robots des utilisateurs"]
[]
[null,"Le document de vision décrit une vision simple du produit. Il content également l'état d'avancement générale du produit.",{"$nulls":5},"Nom","Laurent"]
[{"$nulls":7},"Photo"]
[null,"Qui (equipe)?",null,"Pour qui?",{"$nulls":3},"Age","35 ans"]
[{"$nulls":7},"Profession","Formateur"]
[{"$nulls":7},"Situation familiale","Marié"]
[{"$nulls":7},"Niveau en informatique","Usage courant au travail mais limité au logiciel bureautique"]
[{"$nulls":7},"Caractéristiques","* N'aime pas perdre son temps"]
[{"$nulls":8},"* Souhaite former correctement"]
[]
[{"$nulls":7},"Objectifs","* Simplfier la formation a distance"]
[{"$nulls":8},"* Avoir un suivi des apprenants"]
[null,null,"Nom du produit"]
[null,null,"Problématique ?"]
[{"$nulls":6},"Scénarios",null,"* cherche sur internet des cours"]
[null,"But (Quoi)?",null,"Comment?",null,null,"Quoi : que doit faire le user",null,"* se connecter depuis une tablette"]
[{"$nulls":6},"Comment : comportement et cheminement"]
[]
[]
[]
[]
[{"$nulls":5},"Roadmap"]
[]
[{"$nulls":8},"Version 1","Version 2","Version 3","Version 4"]
[{"$nulls":7},"Nom, date…"]
["Langage du domaine / du métier",{"$nulls":6},"Divers"]
[{"$nulls":7},"Objectifs"]
[null,"Nom","Définission"]
[]
[{"$nulls":5},"Obstacles"]
[]
[{"$nulls":6},"Nom",null,"Obstacle","Actions","Tendance","Statut"]
[{"$nulls":10},"ì"]
[{"$nulls":10},"î"]
[{"$nulls":10},"è"]

{"sheet":"BACKLOG","index":1,"n_rows":142,"n_cols":8,"rows_kept":142,"merged":[[0,0,0,2]]}
["BACKLOG"]
[]
[null,"Un \"backlog\" est une liste de fonctionnalités ou de tâches, jugées nécessaires et suffisantes pour la satisfaisante du client."]
[]
[]
["ID","Importance","Nom / Titre","Histoire","Comment tester ?","Estimatation","Sprint","Statu"]
[1,30,"Afficher les anomalies","En tant que consultant  Je veux accéder aux dernieres anomalies Afin d'alerter mes clients ","Soit un consultant lorsqu'il accede à la page \"suivit\" du client midas, alors il s'affiche une liste d'anoamlies",5]
[2,3,"Valider  le doc","En tant que client Je veux valider les données Afin de mettre a jour le système","Soit un client lorsqu'il a fini de saisir les données manquantes alors il coche la propriété \"valider\" du document en vigueur",3]
[3,5,"besoin 1","En tant que formateur Je veux …. Afin de  gerer les note ","Soit ...  lorsqu'il  ... alors ….",8]
[4,7,"besoin 2","En tant que …. Je veux …. Afin de  … ","Soit ...  lorsqu'il  ... alors ….",20]
[5,9,"besoin 3","En tant que …. Je veux …. Afin de  … ","Soit ...  lorsqu'il  ... alors ….",15]
[6,11,"besoin 4","En tant que …. Je veux …. Afin de  … ","Soit ...  lorsqu'il  ... alors ….",1]
[7,10,"besoin 5","En tant que …. Je veux …. Afin de  … ","Soit ...  lorsqu'il  ... alors ….",20]
[8,3,"besoin 6","En tant que …. Je veux …. Afin de  … ","Soit ...  lorsqu'il  ... alors ….",10]
[9,17,"besoin 7","En tant que …. Je veux …. Afin de  … ","Soit ...  lorsqu'il  ... alors ….",20]
[10,5,"besoin 8","En tant que …. Je veux …. Afin de  … ","Soit ...  lorsqu'il  ... alors ….",2]
[11,21,"besoin 9","En tant que …. Je veux …. Afin de  … ","Soit ...  lorsqu'il  ... alors ….",4]
[12,23,"besoin 10","En tant que …. Je veux …. Afin de  … ","Soit ...  lorsqu'il  ... alors ….",53]
[13,25,"besoin 11","En tant que …. Je veux …. Afin de  … ","Soit ...  lorsqu'il  ... alors ….",3]
[14,27,"besoin 12","En tant que …. Je veux …. Afin de  … ","Soit ...  lorsqu'il  ... alors ….",5]
[15,null,null,"En tant que …. Je veux …. Afin de  … "]
[16]
[17]
[18]
[19]
[20]
[21]
[22]
[23]
[24]
[25]
[26]
[27]
[28]
[29]
[30]
[31]
[32]
[33]
[34]
[35]
[36]
[37]
[38]
[39]
[40]
[41]
[42]
[43]
[44]
[45]
[46]
[47]
[48]
[49]
[50]
[51]
[52]
[53]
[54]
[55]
[56]
[57]
[58]
[59]
[60]
[61]
[62]
[63]
[64]
[65]
[66]
[67]
[68]
[69]
[70]
[71]
[72]
[73]
[74]
{"$rows_left_out":63}
{"sheet":"Tableau de bord","index":2,"n_rows":7,"n_cols":8,"rows_kept":7,"merged":[[0,0,0,4],[5,0,5,1]]}
["Calcul des unités restantes des mêlée "]
[]
[]
[]
[null,null,"Sprint 1","Sprint 2","Sprint 3","Sprint 4","Sprint 5","Sprint 6"]
["Charge des sprints",null,{"$f":"'Sprint 1'!I18","v":{"v":56,"d":"56.00"}}]
[null,"Restant fin",{"$f":"'Sprint 1'!AA18","v":0},0,0,0,0,0]

{"sheet":"CARDS","index":3,"n_rows":326,"n_cols":4,"rows_kept":326}
["Backlog Item #1"]
[{"$nulls":3},"Importance"]
[null,"Afficher les anomalies",null,30]
[null,"Histoire",null,"Estimation"]
[null,"Afin d'alerter mes clients En tant que consultant  Je veux accéder aux dernieres anomalies",null,5]
[]
[null,"Comment tester ?"]
[null,"Soit un consultant lorsqu'il accede à la page \"suivit\" du client midas, alors il s'affiche une liste d'anoamlies"]
[]
[]
[]
["Backlog Item #14"]
[{"$nulls":3},"Importance"]
[null,"besoin 12",null,27]
[null,"Histoire",null,"Estimation"]
[null,"Afin de  … En tant que …. Je veux ….",null,5]
[]
[null,"Comment tester ?"]
[null,"Soit ...  lorsqu'il  ... alors …."]
[]
[]
[]
["Backlog Item #13"]
[{"$nulls":3},"Importance"]
[null,"besoin 11",null,25]
[null,"Histoire",null,"Estimation"]
[null,"Afin de  … En tant que …. Je veux ….",null,3]
[]
[null,"Comment tester ?"]
[null,"Soit ...  lorsqu'il  ... alors …."]
[]
[]
[]
["Backlog Item #12"]
[{"$nulls":3},"Importance"]
[null,"besoin 10",null,23]
[null,"Histoire",null,"Estimation"]
[null,"Afin de  … En tant que …. Je veux ….",null,53]
[]
[null,"Comment tester ?"]
[null,"Soit ...  lorsqu'il  ... alors …."]
[]
[]
[]
["Backlog Item #11"]
[{"$nulls":3},"Importance"]
[null,"besoin 9",null,21]
[null,"Histoire",null,"Estimation"]
[null,"Afin de  … En tant que …. Je veux ….",null,4]
[]
[null,"Comment tester ?"]
[null,"Soit ...  lorsqu'il  ... alors …."]
[]
[]
[]
["Backlog Item #9"]
[{"$nulls":3},"Importance"]
[null,"besoin 7",null,17]
[null,"Histoire",null,"Estimation"]
[null,"Afin de  … En tant que …. Je veux ….",null,20]
[]
[null,"Comment tester ?"]
[null,"Soit ...  lorsqu'il  ... alors …."]
[]
[]
[]
["Backlog Item #6"]
[{"$nulls":3},"Importance"]
[null,"besoin 4",null,11]
[null,"Histoire",null,"Estimation"]
[null,"Afin de  … En tant que …. Je veux ….",null,1]
[]
[null,"Comment tester ?"]
[null,"Soit ...  lorsqu'il  ... alors …."]
[]
[]
[]
["Backlog Item #7"]
[{"$nulls":3},"Importance"]
[null,"besoin 5",null,10]
{"$rows_left_out":247}
{"sheet":"TEMPLATE","index":4,"n_rows":267,"n_cols":12,"rows_kept":267}
["Backlog item #"]
[{"$nulls":3},"Importance"]
[null,"Story name description",null,0]
[null,"Histoire",null,"Estimation"]
[null,"Notes for this story",null,0]
[]
[null,"Comment tester ?"]
[null,"This explains how to demo"]
[]
[]
[{"$nulls":7},{"$f":"BACKLOG!C7","v":"Afficher les anomalies"},{"$f":"BACKLOG!A7","v":1},{"$f":"BACKLOG!B7","v":30},{"$f":"BACKLOG!F7","v":5},"Utiliser pour la fonction recherche dans les sprints"]
[{"$nulls":7},{"$f":"BACKLOG!C8","v":"Valider  le doc"},{"$f":"BACKLOG!A8","v":2},{"$f":"BACKLOG!B8","v":3},{"$f":"BACKLOG!F8","v":3}]
[{"$nulls":7},{"$f":"BACKLOG!C9","v":"besoin 1"},{"$f":"BACKLOG!A9","v":3},{"$f":"BACKLOG!B9","v":5},{"$f":"BACKLOG!F9","v":8}]
[{"$nulls":7},{"$f":"BACKLOG!C10","v":"besoin 2"},{"$f":"BACKLOG!A10","v":4},{"$f":"BACKLOG!B10","v":7},{"$f":"BACKLOG!F10","v":20}]
[{"$nulls":7},{"$f":"BACKLOG!C11","v":"besoin 3"},{"$f":"BACKLOG!A11","v":5},{"$f":"BACKLOG!B11","v":9},{"$f":"BACKLOG!F11","v":15}]
[{"$nulls":7},{"$f":"BACKLOG!C12","v":"besoin 4"},{"$f":"BACKLOG!A12","v":6},{"$f":"BACKLOG!B12","v":11},{"$f":"BACKLOG!F12","v":1}]
[{"$nulls":7},{"$f":"BACKLOG!C13","v":"besoin 5"},{"$f":"BACKLOG!A13","v":7},{"$f":"BACKLOG!B13","v":10},{"$f":"BACKLOG!F13","v":20}]
[{"$nulls":7},{"$f":"BACKLOG!C14","v":"besoin 6"},{"$f":"BACKLOG!A14","v":8},{"$f":"BACKLOG!B14","v":3},{"$f":"BACKLOG!F14","v":10}]
[{"$nulls":7},{"$f":"BACKLOG!C15","v":"besoin 7"},{"$f":"BACKLOG!A15","v":9},{"$f":"BACKLOG!B15","v":17},{"$f":"BACKLOG!F15","v":20}]
[{"$nulls":7},{"$f":"BACKLOG!C16","v":"besoin 8"},{"$f":"BACKLOG!A16","v":10},{"$f":"BACKLOG!B16","v":5},{"$f":"BACKLOG!F16","v":2}]
[{"$nulls":7},{"$f":"BACKLOG!C17","v":"besoin 9"},{"$f":"BACKLOG!A17","v":11},{"$f":"BACKLOG!B17","v":21},{"$f":"BACKLOG!F17","v":4}]
[{"$nulls":7},{"$f":"BACKLOG!C18","v":"besoin 10"},{"$f":"BACKLOG!A18","v":12},{"$f":"BACKLOG!B18","v":23},{"$f":"BACKLOG!F18","v":53}]
[{"$nulls":7},{"$f":"BACKLOG!C19","v":"besoin 11"},{"$f":"BACKLOG!A19","v":13},{"$f":"BACKLOG!B19","v":25},{"$f":"BACKLOG!F19","v":3}]
[{"$nulls":7},{"$f":"BACKLOG!C20","v":"besoin 12"},{"$f":"BACKLOG!A20","v":14},{"$f":"BACKLOG!B20","v":27},{"$f":"BACKLOG!F20","v":5}]
[{"$nulls":7},{"$f":"BACKLOG!C21","v":0},{"$f":"BACKLOG!A21","v":15},{"$f":"BACKLOG!B21","v":0},{"$f":"BACKLOG!F21","v":0}]
[{"$nulls":7},{"$f":"BACKLOG!C22","v":0},{"$f":"BACKLOG!A22","v":16},{"$f":"BACKLOG!B22","v":0},{"$f":"BACKLOG!F22","v":0}]
[{"$nulls":7},{"$f":"BACKLOG!C23","v":0},{"$f":"BACKLOG!A23","v":17},{"$f":"BACKLOG!B23","v":0},{"$f":"BACKLOG!F23","v":0}]
[{"$nulls":7},{"$f":"BACKLOG!C24","v":0},{"$f":"BACKLOG!A24","v":18},{"$f":"BACKLOG!B24","v":0},{"$f":"BACKLOG!F24","v":0}]
[{"$nulls":7},{"$f":"BACKLOG!C25","v":0},{"$f":"BACKLOG!A25","v":19},{"$f":"BACKLOG!B25","v":0},{"$f":"BACKLOG!F25","v":0}]
[{"$nulls":7},{"$f":"BACKLOG!C26","v":0},{"$f":"BACKLOG!A26","v":20},{"$f":"BACKLOG!B26","v":0},{"$f":"BACKLOG!F26","v":0}]
[{"$nulls":7},{"$f":"BACKLOG!C27","v":0},{"$f":"BACKLOG!A27","v":21},{"$f":"BACKLOG!B27","v":0},{"$f":"BACKLOG!F27","v":0}]
[{"$nulls":7},{"$f":"BACKLOG!C28","v":0},{"$f":"BACKLOG!A28","v":22},{"$f":"BACKLOG!B28","v":0},{"$f":"BACKLOG!F28","v":0}]
[{"$nulls":7},{"$f":"BACKLOG!C29","v":0},{"$f":"BACKLOG!A29","v":23},{"$f":"BACKLOG!B29","v":0},{"$f":"BACKLOG!F29","v":0}]
[{"$nulls":7},{"$f":"BACKLOG!C30","v":0},{"$f":"BACKLOG!A30","v":24},{"$f":"BACKLOG!B30","v":0},{"$f":"BACKLOG!F30","v":0}]
[{"$nulls":7},{"$f":"BACKLOG!C31","v":0},{"$f":"BACKLOG!A31","v":25},{"$f":"BACKLOG!B31","v":0},{"$f":"BACKLOG!F31","v":0}]
[{"$nulls":7},{"$f":"BACKLOG!C32","v":0},{"$f":"BACKLOG!A32","v":26},{"$f":"BACKLOG!B32","v":0},{"$f":"BACKLOG!F32","v":0}]
[{"$nulls":7},{"$f":"BACKLOG!C33","v":0},{"$f":"BACKLOG!A33","v":27},{"$f":"BACKLOG!B33","v":0},{"$f":"BACKLOG!F33","v":0}]
[{"$nulls":7},{"$f":"BACKLOG!C34","v":0},{"$f":"BACKLOG!A34","v":28},{"$f":"BACKLOG!B34","v":0},{"$f":"BACKLOG!F34","v":0}]
[{"$nulls":7},{"$f":"BACKLOG!C35","v":0},{"$f":"BACKLOG!A35","v":29},{"$f":"BACKLOG!B35","v":0},{"$f":"BACKLOG!F35","v":0}]
[{"$nulls":7},{"$f":"BACKLOG!C36","v":0},{"$f":"BACKLOG!A36","v":30},{"$f":"BACKLOG!B36","v":0},{"$f":"BACKLOG!F36","v":0}]
[{"$nulls":7},{"$f":"BACKLOG!C37","v":0},{"$f":"BACKLOG!A37","v":31},{"$f":"BACKLOG!B37","v":0},{"$f":"BACKLOG!F37","v":0}]
[{"$nulls":7},{"$f":"BACKLOG!C38","v":0},{"$f":"BACKLOG!A38","v":32},{"$f":"BACKLOG!B38","v":0},{"$f":"BACKLOG!F38","v":0}]
[{"$nulls":7},{"$f":"BACKLOG!C39","v":0},{"$f":"BACKLOG!A39","v":33},{"$f":"BACKLOG!B39","v":0},{"$f":"BACKLOG!F39","v":0}]
[{"$nulls":7},{"$f":"BACKLOG!C40","v":0},{"$f":"BACKLOG!A40","v":34},{"$f":"BACKLOG!B40","v":0},{"$f":"BACKLOG!F40","v":0}]
[{"$nulls":7},{"$f":"BACKLOG!C41","v":0},{"$f":"BACKLOG!A41","v":35},{"$f":"BACKLOG!B41","v":0},{"$f":"BACKLOG!F41","v":0}]
[{"$nulls":7},{"$f":"BACKLOG!C42","v":0},{"$f":"BACKLOG!A42","v":36},{"$f":"BACKLOG!B42","v":0},{"$f":"BACKLOG!F42","v":0}]
[{"$nulls":7},{"$f":"BACKLOG!C43","v":0},{"$f":"BACKLOG!A43","v":37},{"$f":"BACKLOG!B43","v":0},{"$f":"BACKLOG!F43","v":0}]
[{"$nulls":7},{"$f":"BACKLOG!C44","v":0},{"$f":"BACKLOG!A44","v":38},{"$f":"BACKLOG!B44","v":0},{"$f":"BACKLOG!F44","v":0}]
[{"$nulls":7},{"$f":"BACKLOG!C45","v":0},{"$f":"BACKLOG!A45","v":39},{"$f":"BACKLOG!B45","v":0},{"$f":"BACKLOG!F45","v":0}]
[{"$nulls":7},{"$f":"BACKLOG!C46","v":0},{"$f":"BACKLOG!A46","v":40},{"$f":"BACKLOG!B46","v":0},{"$f":"BACKLOG!F46","v":0}]
[{"$nulls":7},{"$f":"BACKLOG!C47","v":0},{"$f":"BACKLOG!A47","v":41},{"$f":"BACKLOG!B47","v":0},{"$f":"BACKLOG!F47","v":0}]
[{"$nulls":7},{"$f":"BACKLOG!C48","v":0},{"$f":"BACKLOG!A48","v":42},{"$f":"BACKLOG!B48","v":0},{"$f":"BACKLOG!F48","v":0}]
[{"$nulls":7},{"$f":"BACKLOG!C49","v":0},{"$f":"BACKLOG!A49","v":43},{"$f":"BACKLOG!B49","v":0},{"$f":"BACKLOG!F49","v":0}]
[{"$nulls":7},{"$f":"BACKLOG!C50","v":0},{"$f":"BACKLOG!A50","v":44},{"$f":"BACKLOG!B50","v":0},{"$f":"BACKLOG!F50","v":0}]
[{"$nulls":7},{"$f":"BACKLOG!C51","v":0},{"$f":"BACKLOG!A51","v":45},{"$f":"BACKLOG!B51","v":0},{"$f":"BACKLOG!F51","v":0}]
[{"$nulls":7},{"$f":"BACKLOG!C52","v":0},{"$f":"BACKLOG!A52","v":46},{"$f":"BACKLOG!B52","v":0},{"$f":"BACKLOG!F52","v":0}]
[{"$nulls":7},{"$f":"BACKLOG!C53","v":0},{"$f":"BACKLOG!A53","v":47},{"$f":"BACKLOG!B53","v":0},{"$f":"BACKLOG!F53","v":0}]
[{"$nulls":7},{"$f":"BACKLOG!C54","v":0},{"$f":"BACKLOG!A54","v":48},{"$f":"BACKLOG!B54","v":0},{"$f":"BACKLOG!F54","v":0}]
[{"$nulls":7},{"$f":"BACKLOG!C55","v":0},{"$f":"BACKLOG!A55","v":49},{"$f":"BACKLOG!B55","v":0},{"$f":"BACKLOG!F55","v":0}]
[{"$nulls":7},{"$f":"BACKLOG!C56","v":0},{"$f":"BACKLOG!A56","v":50},{"$f":"BACKLOG!B56","v":0},{"$f":"BACKLOG!F56","v":0}]
[{"$nulls":7},{"$f":"BACKLOG!C57","v":0},{"$f":"BACKLOG!A57","v":51},{"$f":"BACKLOG!B57","v":0},{"$f":"BACKLOG!F57","v":0}]
[{"$nulls":7},{"$f":"BACKLOG!C58","v":0},{"$f":"BACKLOG!A58","v":52},{"$f":"BACKLOG!B58","v":0},{"$f":"BACKLOG!F58","v":0}]
[{"$nulls":7},{"$f":"BACKLOG!C59","v":0},{"$f":"BACKLOG!A59","v":53},{"$f":"BACKLOG!B59","v":0},{"$f":"BACKLOG!F59","v":0}]
[{"$nulls":7},{"$f":"BACKLOG!C60","v":0},{"$f":"BACKLOG!A60","v":54},{"$f":"BACKLOG!B60","v":0},{"$f":"BACKLOG!F60","v":0}]
[{"$nulls":7},{"$f":"BACKLOG!C61","v":0},{"$f":"BACKLOG!A61","v":55},{"$f":"BACKLOG!B61","v":0},{"$f":"BACKLOG!F61","v":0}]
[{"$nulls":7},{"$f":"BACKLOG!C62","v":0},{"$f":"BACKLOG!A62","v":56},{"$f":"BACKLOG!B62","v":0},{"$f":"BACKLOG!F62","v":0}]
[{"$nulls":7},{"$f":"BACKLOG!C63","v":0},{"$f":"BACKLOG!A63","v":57},{"$f":"BACKLOG!B63","v":0},{"$f":"BACKLOG!F63","v":0}]
[{"$nulls":7},{"$f":"BACKLOG!C64","v":0},{"$f":"BACKLOG!A64","v":58},{"$f":"BACKLOG!B64","v":0},{"$f":"BACKLOG!F64","v":0}]
[{"$nulls":7},{"$f":"BACKLOG!C65","v":0},{"$f":"BACKLOG!A65","v":59},{"$f":"BACKLOG!B65","v":0},{"$f":"BACKLOG!F65","v":0}]
[{"$nulls":7},{"$f":"BACKLOG!C66","v":0},{"$f":"BACKLOG!A66","v":60},{"$f":"BACKLOG!B66","v":0},{"$f":"BACKLOG!F66","v":0}]
[{"$nulls":7},{"$f":"BACKLOG!C67","v":0},{"$f":"BACKLOG!A67","v":61},{"$f":"BACKLOG!B67","v":0},{"$f":"BACKLOG!F67","v":0}]
[{"$nulls":7},{"$f":"BACKLOG!C68","v":0},{"$f":"BACKLOG!A68","v":62},{"$f":"BACKLOG!B68","v":0},{"$f":"BACKLOG!F68","v":0}]
[{"$nulls":7},{"$f":"BACKLOG!C69","v":0},{"$f":"BACKLOG!A69","v":63},{"$f":"BACKLOG!B69","v":0},{"$f":"BACKLOG!F69","v":0}]
[{"$nulls":7},{"$f":"BACKLOG!C70","v":0},{"$f":"BACKLOG!A70","v":64},{"$f":"BACKLOG!B70","v":0},{"$f":"BACKLOG!F70","v":0}]
[{"$nulls":7},{"$f":"BACKLOG!C71","v":0},{"$f":"BACKLOG!A71","v":65},{"$f":"BACKLOG!B71","v":0},{"$f":"BACKLOG!F71","v":0}]
[{"$nulls":7},{"$f":"BACKLOG!C72","v":0},{"$f":"BACKLOG!A72","v":66},{"$f":"BACKLOG!B72","v":0},{"$f":"BACKLOG!F72","v":0}]
[{"$nulls":7},{"$f":"BACKLOG!C73","v":0},{"$f":"BACKLOG!A73","v":67},{"$f":"BACKLOG!B73","v":0},{"$f":"BACKLOG!F73","v":0}]
[{"$nulls":7},{"$f":"BACKLOG!C74","v":0},{"$f":"BACKLOG!A74","v":68},{"$f":"BACKLOG!B74","v":0},{"$f":"BACKLOG!F74","v":0}]
[{"$nulls":7},{"$f":"BACKLOG!C75","v":0},{"$f":"BACKLOG!A75","v":69},{"$f":"BACKLOG!B75","v":0},{"$f":"BACKLOG!F75","v":0}]
[{"$nulls":7},{"$f":"BACKLOG!C76","v":0},{"$f":"BACKLOG!A76","v":70},{"$f":"BACKLOG!B76","v":0},{"$f":"BACKLOG!F76","v":0}]
{"$rows_left_out":188}
{"sheet":"Sprint Vierge","index":5,"n_rows":43,"n_cols":28,"rows_kept":43,"merged":[[0,0,0,2],[0,10,0,15],[1,10,1,11],[1,12,1,13],[1,14,1,15],[2,14,2,15],[16,0,18,0],[16,1,18,2],[17,6,17,7],[18,6,18,7],[19,1,19,2],[23,1,23,2],[25,1,25,2],[26,1,26,2],[27,1,27,2],[28,1,28,2],[29,1,29,2]]}
[{"$f":"CONCATENATE('Document de vision'!C14,\" : Sprint 1\")","v":"Nom du produit : Sprint 1"},{"$nulls":9},"Pour le calcul de la prévision"]
[{"$nulls":10},"Known X",null,"Effort",null,"Reste à faire"]
[{"$nulls":10},0,null,{"$f":"C6","v":0},0,0]
[null,"Date de début :","2008-10-21",{"$nulls":7},{"$f":"C8-1","v":9}]
[null,"Date de fin (incluse) :",{"$f":"WORKDAY(C4,C8)","v":"2008-11-04"}]
[null,"Effort initial :",{"$f":"$I18","v":0}]
[null,"Objectifs du Sprint :","Mettre en place une page de connexion"]
[null,"Durée d'un sprint (jours) :",10]
[null,"Météo du sprint :"]
[]
[]
[null,"Elément pour la météo du sprint :"]
[]
[]
[]
[]
["Story ID","Story/Tâche",{"$nulls":3},"Fini","Importance","Estimation","lun",1,"mar",2,"mer",3,"jeu",4,"ven",5,"lun",6,"mar",7,"mer",8,"jeu",9,"ven",10]
[{"$nulls":4},"En cours",null,"Reste à faire (point/jr) :",null,{"$f":"SUM(I20:I33)","v":0},0,0,0,0,0,0,0,0,0,0,0,0,0,0,0,0,0,{"$f":"SUM(AA20:AA33)","v":0},{"$f":"SUM(AB20:AB33)","v":0}]
[{"$nulls":3},"A faire",null,null,"Prévision :",null,{"$f":"FORECAST(J17-1, $M$3:$N$3,$K$3:$K$4)","v":{"v":0,"d":"0.0"}},null,{"$f":"FORECAST(L17-1, $M$3:$N$3,$K$3:$K$4)","v":{"v":0,"d":"0.0"}},null,{"$f":"FORECAST(N17-1, $M$3:$N$3,$K$3:$K$4)","v":{"v":0,"d":"0.0"}},null,{"$f":"FORECAST(P17-1, $M$3:$N$3,$K$3:$K$4)","v":{"v":0,"d":"0.0"}},null,{"$f":"FORECAST(R17-1, $M$3:$N$3,$K$3:$K$4)","v":{"v":0,"d":"0.0"}},null,{"$f":"FORECAST(T17-1, $M$3:$N$3,$K$3:$K$4)","v":{"v":0,"d":"0.0"}},null,{"$f":"FORECAST(V17-1, $M$3:$N$3,$K$3:$K$4)","v":{"v":0,"d":"0.0"}},null,{"$f":"FORECAST(X17-1, $M$3:$N$3,$K$3:$K$4)","v":{"v":0,"d":"0.0"}},null,{"$f":"FORECAST(Z17-1, $M$3:$N$3,$K$3:$K$4)","v":{"v":0,"d":"0.0"}},null,{"$f":"FORECAST(AB17-1, $M$3:$N$3,$K$3:$K$4)","v":{"v":0,"d":"0.0"}}]
[{"$f":"VLOOKUP($B20,TEMPLATE!$H$11:$K$267,2)","v":0},{"$nulls":5},{"$f":"VLOOKUP($B20,TEMPLATE!$H$11:$K$267,3)","v":0},{"$f":"VLOOKUP($B20,TEMPLATE!$H$11:$K$267,4)","v":0},{"$f":"H20","v":0}]
[{"$nulls":5},"x",null,null,{"$f":"H21","v":0}]
[{"$nulls":8},0]
[{"$nulls":8},0]
[{"$f":"VLOOKUP($B24,TEMPLATE!$H$11:$K$267,2)","v":0},{"$nulls":4},"x",{"$f":"VLOOKUP($B24,TEMPLATE!$H$11:$K$267,3)","v":0},{"$f":"VLOOKUP($B24,TEMPLATE!$H$11:$K$267,4)","v":0},0]
[{"$nulls":8},0]
[{"$f":"VLOOKUP($B26,TEMPLATE!$H$11:$K$267,2)","v":0},{"$nulls":4},"x",{"$f":"VLOOKUP($B26,TEMPLATE!$H$11:$K$267,3)","v":0},{"$f":"VLOOKUP($B26,TEMPLATE!$H$11:$K$267,4)","v":0},0]
[{"$f":"VLOOKUP($B27,TEMPLATE!$H$11:$K$267,2)","v":0},{"$nulls":4},"x",{"$f":"VLOOKUP($B27,TEMPLATE!$H$11:$K$267,3)","v":0},{"$f":"VLOOKUP($B27,TEMPLATE!$H$11:$K$267,4)","v":0},0]
[{"$f":"VLOOKUP($B28,TEMPLATE!$H$11:$K$267,2)","v":0},{"$nulls":4},"x",{"$f":"VLOOKUP($B28,TEMPLATE!$H$11:$K$267,3)","v":0},{"$f":"VLOOKUP($B28,TEMPLATE!$H$11:$K$267,4)","v":0},0]
[{"$f":"VLOOKUP($B29,TEMPLATE!$H$11:$K$267,2)","v":0},{"$nulls":5},{"$f":"VLOOKUP($B29,TEMPLATE!$H$11:$K$267,3)","v":0},{"$f":"VLOOKUP($B29,TEMPLATE!$H$11:$K$267,4)","v":0},0]
[{"$f":"VLOOKUP($B30,TEMPLATE!$H$11:$K$267,2)","v":0},{"$nulls":5},{"$f":"VLOOKUP($B30,TEMPLATE!$H$11:$K$267,3)","v":0},{"$f":"VLOOKUP($B30,TEMPLATE!$H$11:$K$267,4)","v":0},0]
[{"$nulls":8},0]
[{"$nulls":8},0]
[{"$nulls":8},0]
[{"$nulls":8},0]
[{"$nulls":8},0]
[{"$nulls":8},0]
[{"$nulls":8},0]
[{"$nulls":8},0]
[{"$nulls":8},0]
[{"$nulls":8},0]
[{"$nulls":8},0]
[{"$nulls":8},0]
[{"$nulls":8},0]

{"sheet":"Sprint 1","index":6,"n_rows":43,"n_cols":28,"rows_kept":43,"merged":[[0,0,0,2],[0,10,0,15],[1,10,1,11],[1,12,1,13],[1,14,1,15],[2,14,2,15],[16,0,18,0],[16,1,18,2],[17,6,17,7],[18,6,18,7],[19,1,19,2],[23,1,23,2],[25,1,25,2],[26,1,26,2],[27,1,27,2],[28,1,28,2],[29,1,29,2]]}
[{"$f":"CONCATENATE('Document de vision'!C14,\" : Sprint 1\")","v":"Nom du produit : Sprint 1"},{"$nulls":9},"Pour le calcul de la prévision"]
[{"$nulls":10},"Known X",null,"Effort",null,"Reste à faire"]
[{"$nulls":10},0,null,{"$f":"C6","v":56},0,0]
[null,"Date de début :","2008-10-21",{"$nulls":7},{"$f":"C8-1","v":9}]
[null,"Date de fin (incluse) :",{"$f":"WORKDAY(C4,C8)","v":"2008-11-04"}]
[null,"Effort initial :",{"$f":"$I18","v":56}]
[null,"Objectifs du Sprint :","Mettre en place une page de connexion"]
[null,"Durée d'un sprint (jours) :",10]
[null,"Météo du sprint :"]
[]
[]
[null,"Elément pour la météo du sprint :"]
[]
[]
[]
[]
["Story ID","Story/Tâche",{"$nulls":3},"Fini","Importance","Estimation","lun",1,"mar",2,"mer",3,"jeu",4,"ven",5,"lun",6,"mar",7,"mer",8,"jeu",9,"ven",10]
[{"$nulls":4},"En cours",null,"Reste à faire (point/jr) :",null,{"$f":"SUM(I20:I33)","v":56},{"v":7.5,"d":"8"},47,0,45,0,47,0,44,0,36,0,28,0,17,0,5,0,{"$f":"SUM(AA20:AA33)","v":0},{"$f":"SUM(AB20:AB33)","v":0}]
[{"$nulls":3},"A faire",null,null,"Prévision :",null,{"$f":"FORECAST(J17-1, $M$3:$N$3,$K$3:$K$4)","v":{"v":56,"d":"56.0"}},null,{"$f":"FORECAST(L17-1, $M$3:$N$3,$K$3:$K$4)","v":{"v":49.77777777777778,"d":"49.8"}},null,{"$f":"FORECAST(N17-1, $M$3:$N$3,$K$3:$K$4)","v":{"v":43.55555555555556,"d":"43.6"}},null,{"$f":"FORECAST(P17-1, $M$3:$N$3,$K$3:$K$4)","v":{"v":37.33333333333333,"d":"37.3"}},null,{"$f":"FORECAST(R17-1, $M$3:$N$3,$K$3:$K$4)","v":{"v":31.11111111111111,"d":"31.1"}},null,{"$f":"FORECAST(T17-1, $M$3:$N$3,$K$3:$K$4)","v":{"v":24.88888888888889,"d":"24.9"}},null,{"$f":"FORECAST(V17-1, $M$3:$N$3,$K$3:$K$4)","v":{"v":18.666666666666664,"d":"18.7"}},null,{"$f":"FORECAST(X17-1, $M$3:$N$3,$K$3:$K$4)","v":{"v":12.444444444444443,"d":"12.4"}},null,{"$f":"FORECAST(Z17-1, $M$3:$N$3,$K$3:$K$4)","v":{"v":6.222222222222221,"d":"6.2"}},null,{"$f":"FORECAST(AB17-1, $M$3:$N$3,$K$3:$K$4)","v":{"v":0,"d":"0.0"}}]
[{"$f":"VLOOKUP($B20,TEMPLATE!$H$11:$K$267,2)","v":1},"Afficher les anomalies",{"$nulls":4},{"$f":"VLOOKUP($B20,TEMPLATE!$H$11:$K$267,3)","v":30},{"$f":"VLOOKUP($B20,TEMPLATE!$H$11:$K$267,4)","v":5},{"$f":"H20","v":5},null,4,null,0,null,0,null,0,null,0,null,0,null,0,null,0,null,0]
[null,null,"Tâche 1",null,null,"x",{"$nulls":3},0.5]
[null,null,"Tâche 2",{"$nulls":6},1]
[null,null,"Tâche 3",{"$nulls":6},2]
[{"$f":"VLOOKUP($B24,TEMPLATE!$H$11:$K$267,2)","v":1},"besoin 1",{"$nulls":3},"x",{"$f":"VLOOKUP($B24,TEMPLATE!$H$11:$K$267,3)","v":30},{"$f":"VLOOKUP($B24,TEMPLATE!$H$11:$K$267,4)","v":5},{"$f":"H24","v":5},null,4,null,0,null,0,null,0,null,0,null,0,null,0,null,0,null,0]
[null,null,"Tâche 1",{"$nulls":6},4]
[{"$f":"VLOOKUP($B26,TEMPLATE!$H$11:$K$267,2)","v":4},"besoin 2",{"$nulls":3},"x",{"$f":"VLOOKUP($B26,TEMPLATE!$H$11:$K$267,3)","v":7},{"$f":"VLOOKUP($B26,TEMPLATE!$H$11:$K$267,4)","v":20},{"$f":"H26","v":20},null,16,null,14,null,13,null,13,null,8,null,4,null,4,null,4,null,0]
[{"$f":"VLOOKUP($B27,TEMPLATE!$H$11:$K$267,2)","v":14},"besoin 8",{"$nulls":3},"x",{"$f":"VLOOKUP($B27,TEMPLATE!$H$11:$K$267,3)","v":27},{"$f":"VLOOKUP($B27,TEMPLATE!$H$11:$K$267,4)","v":5},{"$f":"H27","v":5},null,4,null,3,null,6,null,3,null,0,null,0,null,0,null,0,null,0]
[{"$f":"VLOOKUP($B28,TEMPLATE!$H$11:$K$267,2)","v":7},"besoin 5",{"$nulls":3},"x",{"$f":"VLOOKUP($B28,TEMPLATE!$H$11:$K$267,3)","v":10},{"$f":"VLOOKUP($B28,TEMPLATE!$H$11:$K$267,4)","v":20},{"$f":"H28","v":20},null,18,null,16,null,16,null,16,null,16,null,12,null,5,null,0,null,0]
[{"$f":"VLOOKUP($B29,TEMPLATE!$H$11:$K$267,2)","v":6},"besoin 4",{"$nulls":4},{"$f":"VLOOKUP($B29,TEMPLATE!$H$11:$K$267,3)","v":11},{"$f":"VLOOKUP($B29,TEMPLATE!$H$11:$K$267,4)","v":1},{"$f":"H29","v":1},null,1,null,12,null,12,null,12,null,12,null,12,null,8,null,1,null,0]
[{"$f":"VLOOKUP($B30,TEMPLATE!$H$11:$K$267,2)","v":0},{"$nulls":5},{"$f":"VLOOKUP($B30,TEMPLATE!$H$11:$K$267,3)","v":0},{"$f":"VLOOKUP($B30,TEMPLATE!$H$11:$K$267,4)","v":0},{"$f":"H30","v":0}]
[{"$nulls":8},0]
[{"$nulls":8},0]
[{"$nulls":8},0]
[{"$nulls":8},0]
[{"$nulls":8},0]
[{"$nulls":8},0]
[{"$nulls":8},0]
[{"$nulls":8},0]
[{"$nulls":8},0]
[{"$nulls":8},0]
[{"$nulls":8},0]
[{"$nulls":8},0]
[{"$nulls":8},0]